�s���{���R-�h���͎s�撬���R-�h,NO,�s���{����,�s�撬����,����,����_�J�i,����_�ʏ�,POI�R-�h,�Z��,����,�ܓx,�o�x,�d�b�ԍ�,�����ԍ�,�@�l�ԍ�,�c�̖�,���p�\�j��,�J�n����,�I������,���p�\���ԓ��L����,�x�ٓ�,����,�o���A�t��-���,URL,���l
12301,1,�k�C��,�o�ʎs,�s�����{����,�V���N�V���z���`���E�V��,,1302,�k�C���o�ʎs������6-11,,42.412742,141.106634,0143-85-2111,,,�o�ʎs,���ΐ��؋�,9:00,17:30,�ؗj�̏I�����Ԃɂ��Ă�19:00,�y�E���j���A�j���A12/29-1/3,,,,
12301,2,�k�C��,�o�ʎs,�s������񒡎�,�V���N�V���_�C�j�`���E�V��,,1302,�k�C���o�ʎs������6-11,,42.413119,141.106042,0143-85-2111,,,�o�ʎs,���ΐ��؋�,9:00,17:30,,�y�E���j���A�j���A12/29-1/3,,,,
12301,3,�k�C��,�o�ʎs,�o�ʎ�����,�m�{���x�c�W�h�E�J��,,1403,�k�C���o�ʎs�o�ʓ���4-19-2,,42.453273,141.174542,0143-83-3493,,,�o�ʎs,���ΐ��؋��y,9:00,17:00,12������2���܂ŏI�����Ԃɂ��Ă�16:00,�j���A12/29-1/3,,,,
12301,4,�k�C��,�o�ʎs,�y�ʎ�����,�z���x�c�W�h�E�J��,,1403,�k�C���o�ʎs�y�ʒ�8-17-1,,42.41652,141.11921,0143-85-2802,,,�o�ʎs,���ΐ��؋��y,9:00,17:00,12������2���܂ŏI�����Ԃɂ��Ă�16:00,�j���A12/29-1/3,,,,
12301,5,�k�C��,�o�ʎs,��Վ�����,�g�L���W�h�E�J��,,1403,�k�C���o�ʎs��Ւ�2-34-9,,42.409962,141.109632,0143-85-1840,,,�o�ʎs,���ΐ��؋��y,9:00,17:00,12������2���܂ŏI�����Ԃɂ��Ă�16:00,�j���A12/29-1/3,,,,
12301,6,�k�C��,�o�ʎs,�x�m������,�t�W�W�h�E�J��,,1403,�k�C���o�ʎs�x�m��1-1-4,,42.412144,141.102739,0143-85-7760,,,�o�ʎs,���ΐ��؋��y,9:00,17:00,12������2���܂ŏI�����Ԃɂ��Ă�16:00,�j���A12/29-1/3,,,,
12301,7,�k�C��,�o�ʎs,�x�l������,�g�~�n�}�W�h�E�J��,,1403,�k�C���o�ʎs�h��2-18-4,,42.371717,141.065193,0143-86-7187,,,�o�ʎs,���ΐ��؋��y,9:00,17:00,12������2���܂ŏI�����Ԃɂ��Ă�16:00,�j���A12/29-1/3,,,,
12301,8,�k�C��,�o�ʎs,�h�ʎ�����,���V�x�c�W�h�E�J��,,1403,�k�C���o�ʎs�h�ʒ�4-36-3,,42.360377,141.051895,0143-87-0003,,,�o�ʎs,���ΐ��؋��y,9:00,17:00,12������2���܂ŏI�����Ԃɂ��Ă�16:00,�j���A12/29-1/3,,,,
12301,9,�k�C��,�o�ʎs,�t������,�A�I�o�W�h�E�J��,,1403,�k�C���o�ʎs�t��3-3,,42.401457,141.084237,0143-88-3321,,,�o�ʎs,���ΐ��؋��y,9:00,17:00,12������2���܂ŏI�����Ԃɂ��Ă�16:00,�j���A12/29-1/3,,,,
12301,10,�k�C��,�o�ʎs,���������Z���^-,�~�\�m�W�h�E�Z���^-,,1403,�k�C���o�ʎs������5-36-4,,42.368633,141.038741,0143-86-4591,,,�o�ʎs,���ΐ��؋��y,9:00,17:00,12������2���܂ŏI�����Ԃɂ��Ă�16:00,�j���A12/29-1/3,,,,
12301,11,�k�C��,�o�ʎs,�o�ʕۈ珊,�m�{���x�c�z�C�N�V��,,1402,�k�C���o�ʎs�o�ʖ{��2-25-9,,42.450437,141.169679,0143-80-1133,,,�o�ʎs,���ΐ��؋��y,7:15,19:15,,�j���A12/29-1/3,,,,
12301,12,�k�C��,�o�ʎs,�y�ʓ��ۈ珊,�z���x�c�q�K�V�z�C�N�V��,,1402,�k�C���o�ʎs�y�ʒ�8-17,,42.416705,141.119328,0143-88-0151,,,�o�ʎs,���ΐ��؋��y,7:15,19:15,,�j���A12/29-1/3,,,,
12301,13,�k�C��,�o�ʎs,�x�m�ۈ珊,�t�W�z�C�N�V��,,1402,�k�C���o�ʎs�x�m��7-2-1,,42.414439,141.097796,0143-85-2557,,,�o�ʎs,���ΐ��؋��y��,7:15,19:15,,�j���A12/29-1/3,,,,
12301,14,�k�C��,�o�ʎs,�h���ۈ珊,�T�J�G�}�`�z�C�N�V��,,1402,�k�C���o�ʎs�h��2-6-1,,42.367427,141.061221,0143-86-9515,,,�o�ʎs,���ΐ��؋��y,7:15,19:15,,�j���A12/29-1/3,,,,
12301,15,�k�C��,�o�ʎs,�h�ʕۈ珊,���V�x�c�z�C�N�V��,,1402,�k�C���o�ʎs�h�ʒ�4-36-18,,42.362337,141.054558,0143-86-7254,,,�o�ʎs,���ΐ��؋��y,7:15,19:15,,�j���A12/29-1/3,,,,
12301,16,�k�C��,�o�ʎs,�����q��Ďx���Z���^-,�`���E�I�E�R�\�_�e�V�G���Z���^-,,1403,�k�C���o�ʎs�x�m��7-2-1,,42.414699,141.09768,0143-81-3715,,,�o�ʎs,���ΐ��؋��y,9:00,17:30,�y�j�̏I�����Ԃɂ��Ă�12:00,�j���A12/29-1/3,,,,
12301,17,�k�C��,�o�ʎs,�h�ʎq��Ďx���Z���^-,���V�x�c�R�\�_�e�V�G���Z���^-,,1403,�k�C���o�ʎs�h�ʒ�4-36-6,,42.360377,141.051895,0143-84-1235,,,�o�ʎs,���ΐ��؋�,9:00,17:30,,�j���A12/29-1/3,,,,
12301,18,�k�C��,�o�ʎs,���������Z���^-����21,�\�E�S�E�t�N�V�Z���^-�V���^�j�W���E�C�`,,1499,�k�C���o�ʎs�Бq��6-9-1,,42.418798,141.084908,0143-85-0100,,,�o�ʎs,���ΐ��؋��y��,9:00,21:00,���j�A�j���̏I�����Ԃɂ��Ă�17:00,12/29-1/3,,,,
12301,19,�k�C��,�o�ʎs,�S��ӂꂠ���Z���^-,�e�c�i���t���A�C�Z���^-,,1599,�k�C���o�ʎs�y�ʒ�3-17-1,,42.411631,141.110732,0143-85-2966,,,�o�ʎs,�ΐ��؋��y��,9:00,22:00,�j���̌��j�J�فB�{�ݗ��p�󋵎����18:00�ȍ~�͗��p�s�B,�j���̗����A12/29-1/3,,,,
12301,20,�k�C��,�o�ʎs,�����f�C�T�[�r�X�Z���^�[�̂��݉�,�W�h�E�f�C�T�[�r�X�Z���^�[�m�]�~�G��,,1499,�k�C���o�ʎs�y�ʒ�3-17-4,,42.41199,141.110764,0143-85-7721,,,�o�ʎs,���ΐ��؋�,9:00,17:30,,�j���A12/29-1/3,,,,
12301,21,�k�C��,�o�ʎs,�V�l�����Z���^-,���E�W���t�N�V�Z���^-,,1499,�k�C���o�ʎs�x�m��7-11-1,,42.413566,141.096736,0143-88-1303,,,�o�ʎs,�ΐ��؋��y��,10:00,16:00,,�j���A12/29-1/3,,,,
12301,22,�k�C��,�o�ʎs,�x�Y���,�g�~�E���J�C�J��,,1309,�k�C���o�ʎs�x�Y��1-46-4,,42.443777,141.159301,,,,�o�ʎs,���ΐ��؋��y��,9:00,22:00,,,,,,
12301,23,�k�C��,�o�ʎs,�x�m���,�t�W�J�C�J��,,1309,�k�C���o�ʎs�x�m��7-2-1,,42.414691,141.098426,0143-88-1253,,,�o�ʎs,���ΐ��؋��y��,9:00,22:00,,,,,,
12301,24,�k�C��,�o�ʎs,�ᑐ�ǂ��Z���^�[,���J�N�T�c�h�C�Z���^�[,,1305,�k�C���o�ʎs�ᑐ��4-21-1,,42.371915,141.057131,0143-86-1205,,,�o�ʎs,���ΐ��؋��y��,9:00,22:00,,12/29-1/3,,,,
12301,25,�k�C��,�o�ʎs,�����̉�,�V���J�o�m�C�G,,1499,�k�C���o�ʎs���o�ʒ�152-3,,42.472757,141.161024,,,,�o�ʎs,���ΐ��؋��y��,9:00,22:00,,,,,,
12301,26,�k�C��,�o�ʎs,���a��,���C���G��,,1499,�k�C���o�ʎs�o�ʓ���2-21-1,,42.452514,141.177025,,,,�o�ʎs,���ΐ��؋��y��,9:00,22:00,,,,,,
12301,27,�k�C��,�o�ʎs,�����̉�,�V�I�~�m�C�G,,1499,�k�C���o�ʎs�o�ʓ���4-38-47,,42.45698,141.176132,,,,�o�ʎs,���ΐ��؋��y��,9:00,22:00,,,,,,
12301,28,�k�C��,�o�ʎs,���̉�,�~�h���m�C�G,,1499,�k�C���o�ʎs�o�ʓ���5-13-6,,42.454299,141.171811,,,,�o�ʎs,���ΐ��؋��y��,9:00,22:00,,,,,,
12301,29,�k�C��,�o�ʎs,���u�̉�,�t���E�m�C�G,,1499,�k�C���o�ʎs�o�ʖ{��1-18-5,,42.449902,141.173419,,,,�o�ʎs,���ΐ��؋��y��,9:00,22:00,,,,,,
12301,30,�k�C��,�o�ʎs,�D����y��,�T�c�i�C�J�C���N�G��,,1499,�k�C���o�ʎs�D����73-1,,42.457852,141.117969,,,,�o�ʎs,���ΐ��؋��y��,9:00,22:00,,,,,,
12301,31,�k�C��,�o�ʎs,�������̉�,�X�Y�����m�C�G,,1499,�k�C���o�ʎs�K��5-27-4,,42.435156,141.140545,,,,�o�ʎs,���ΐ��؋��y��,9:00,22:00,,,,,,
12301,32,�k�C��,�o�ʎs,��Ε�����,�`�g�Z�t�N�W���G��,,1499,�k�C���o�ʎs��Β�101-1,,42.426441,141.115866,,,,�o�ʎs,���ΐ��؋��y��,9:00,22:00,,,,,,
12301,33,�k�C��,�o�ʎs,�i�a��,�G�C���G��,,1499,�k�C���o�ʎs�y�ʒ�3-17-8,,42.411796,141.110552,,,,�o�ʎs,���ΐ��؋��y��,9:00,22:00,,,,,,
12301,34,�k�C��,�o�ʎs,��Չ��,�g�L���J�C�J��,,1499,�k�C���o�ʎs��Ւ�2-35-5,,42.417327,141.105437,,,,�o�ʎs,���ΐ��؋��y��,9:00,22:00,,,,,,
12301,35,�k�C��,�o�ʎs,��Ղ̉�,�g�L���m�C�G,,1499,�k�C���o�ʎs��Ւ�3-26-3,,42.418713,141.107625,0143-85-4564,,,�o�ʎs,���ΐ��؋��y��,9:00,22:00,,,,,,
12301,36,�k�C��,�o�ʎs,�O����,�T���W���G��,,1499,�k�C���o�ʎs������3-10-3,,42.407396,141.103265,,,,�o�ʎs,���ΐ��؋��y��,9:00,22:00,,,,,,
12301,37,�k�C��,�o�ʎs,�Øa��,�Z�C���G��,,1499,�k�C���o�ʎs������5-13-7,,42.413003,141.104464,,,,�o�ʎs,���ΐ��؋��y��,9:00,22:00,,,,,,
12301,38,�k�C��,�o�ʎs,���؂̉�,�J�V���M�m�C�G,,1499,�k�C���o�ʎs���ؒ�4-31-2,,42.419187,141.099224,,,,�o�ʎs,���ΐ��؋��y��,9:00,22:00,,,,,,
12301,39,�k�C��,�o�ʎs,�����̉�,�A�C�I�C�m�C�G,,1499,�k�C���o�ʎs�x�m��1-1-4,,42.412093,141.102756,0143-85-4992,,,�o�ʎs,���ΐ��؋��y��,9:00,22:00,,,,,,
12301,40,�k�C��,�o�ʎs,�~�̖؂̉�,�E���m�L�m�C�G,,1499,�k�C���o�ʎs�Бq��3-14-19,,42.413619,141.089439,0143-85-8041,,,�o�ʎs,���ΐ��؋��y��,9:00,22:00,,,,,,
12301,41,�k�C��,�o�ʎs,�˂ނ̖؂̉�,�l���m�L�m�C�G,,1499,�k�C���o�ʎs�V�쒬3-6-2,,42.407978,141.094969,,,,�o�ʎs,���ΐ��؋��y��,9:00,22:00,,,,,,
12301,42,�k�C��,�o�ʎs,���؂̉�,�T�N���M�m�C�G,,1499,�k�C���o�ʎs���ؒ�2-15-16,,42.404977,141.090551,0143-88-3006,,,�o�ʎs,���ΐ��؋��y��,9:00,22:00,,,,,,
12301,43,�k�C��,�o�ʎs,�Ύ��̉�,�����N�W���m�C�G,,1499,�k�C���o�ʎs�Β�1-2-4,,42.399282,141.09203,,,,�o�ʎs,���ΐ��؋��y��,9:00,22:00,,,,,,
12301,44,�k�C��,�o�ʎs,�a�K��,���R�E�G��,,1499,�k�C���o�ʎs��a��2-27-17,,42.38506,141.078488,,,,�o�ʎs,���ΐ��؋��y��,9:00,22:00,,,,,,
12301,45,�k�C��,�o�ʎs,��������̉�,�A�J�V���m�C�G,,1499,�k�C���o�ʎs��R��2-9-2,,42.388587,141.080053,,,,�o�ʎs,���ΐ��؋��y��,9:00,22:00,,,,,,
12301,46,�k�C��,�o�ʎs,��R�̉�,���J���}�m�C�G,,1499,�k�C���o�ʎs��R��2-43-128,,42.388988,141.076904,,,,�o�ʎs,���ΐ��؋��y��,9:00,22:00,,,,,,
12301,47,�k�C��,�o�ʎs,�Ꭼ�̉�,���J�V�I�m�C�G,,1499,�k�C���o�ʎs��R��4-6-6,,42.381524,141.072587,,,,�o�ʎs,���ΐ��؋��y��,9:00,22:00,,,,,,
12301,48,�k�C��,�o�ʎs,�x�v����,�t�N�W���G��,,1499,�k�C���o�ʎs�x�ݒ�1-3-2,,42.388062,141.069395,0143-85-4980,,,�o�ʎs,���ΐ��؋��y��,9:00,22:00,,,,,,
12301,49,�k�C��,�o�ʎs,�V�����̉�,�V���Z�C�j�W�m�C�G,,1499,�k�C���o�ʎs�V����1-13-21,,42.374054,141.064488,,,,�o�ʎs,���ΐ��؋��y��,9:00,22:00,,,,,,
12301,50,�k�C��,�o�ʎs,��]�̉�,�L�{�E�m�C�G,,1499,�k�C���o�ʎs�V����5-23-21,,42.376693,141.058209,,,,�o�ʎs,���ΐ��؋��y��,9:00,22:00,,,,,,
12301,51,�k�C��,�o�ʎs,���a��,�L���E���G��,,1499,�k�C���o�ʎs�h��1-10-12,,42.367376,141.058607,,,,�o�ʎs,���ΐ��؋��y��,9:00,22:00,,,,,,
12301,52,�k�C��,�o�ʎs,�h�y��,�G�C���N�G��,,1499,�k�C���o�ʎs�h��4-24-3,,42.378123,141.071904,,,,�o�ʎs,���ΐ��؋��y��,9:00,22:00,,,,,,
12301,53,�k�C��,�o�ʎs,�D�a��,���E���G��,,1499,�k�C���o�ʎs�ᑐ��5-32-7,,42.370428,141.050329,0143-86-9905,,,�o�ʎs,���ΐ��؋��y��,9:00,22:00,,,,,,
12301,54,�k�C��,�o�ʎs,�o�a��,�\�E���G��,,1499,�k�C���o�ʎs�h�ʒ�1-26-2,,42.354679,141.048999,,,,�o�ʎs,���ΐ��؋��y��,9:00,22:00,,,,,,
12301,55,�k�C��,�o�ʎs,�b�a��,�P�C���G��,,1499,�k�C���o�ʎs�h�ʒ�4-36-37,,42.361672,141.050889,,,,�o�ʎs,���ΐ��؋��y��,9:00,22:00,,,,,,
12301,56,�k�C��,�o�ʎs,�h�Z��,�V���E���N�G��,,1499,�k�C���o�ʎs�h�ʒ�6-14-10,,42.357214,141.051201,,,,�o�ʎs,���ΐ��؋��y��,9:00,22:00,,,,,,
12301,57,�k�C��,�o�ʎs,�݂��̉�,�~�\�m�G��,,1499,�k�C���o�ʎs������2-6-1,,42.362152,141.046095,,,,�o�ʎs,���ΐ��؋��y��,9:00,22:00,,,,,,
12301,58,�k�C��,�o�ʎs,���a��,�R�E���G��,,1499,�k�C���o�ʎs������3,,42.36415,141.042852,,,,�o�ʎs,���ΐ��؋��y��,9:00,22:00,,,,,,
12301,59,�k�C��,�o�ʎs,���P�u�O�b��,�A�T�q�K�I�J�T���P�C�G��,,1499,�k�C���o�ʎs������4-8-8,,42.364361,141.04572,,,,�o�ʎs,���ΐ��؋��y��,9:00,22:00,,,,,,
12301,60,�k�C��,�o�ʎs,������,�I�E�r�G��,,1499,�k�C���o�ʎs��h�ʒ�117-26,,42.375704,141.039578,,,,�o�ʎs,���ΐ��؋��y��,9:00,22:00,,,,,,
12301,61,�k�C��,�o�ʎs,�N�����N���Z���^-,�N�����N���Z���^-,,2006,�k�C���o�ʎs�K��2-5-1,,42.422336,141.126981,0143-85-2958,,,�o�ʎs,���ΐ��؋�,9:00,17:30,,�j���A12/29-1/3,,,,
12301,62,�k�C��,�o�ʎs,���֏�,�\�E�T�C�W���E,,2099,�k�C���o�ʎs�x�Y��186-1,,42.446655,141.151174,0143-83-1076,,,�o�ʎs,���ΐ��؋��y��,9:00,17:30,,�F���A1/1,,,,
12301,63,�k�C��,�o�ʎs,�E�ƌP���Z���^-,�V���N�M���E�N�������Z���^-,,1514,�k�C���o�ʎs�t��42-13,,42.390012,141.075686,0143-85-1450,,,�o�ʎs,���ΐ��؋�,9:00,17:00,,�j���A12/29-1/3,,,,
12301,64,�k�C��,�o�ʎs,�J�����X����T�����C�o�X�L-��,�J�����X�I���Z���T�����C�o�X�L-�W���E,,1148,�k�C���o�ʎs�J�����X��27-1,,42.521649,141.098053,0143-84-2872,,,�o�ʎs,���ΐ��؋��y��,9:00,16:00,��N12�����{����3�����{�܂ŉc��,,,,,
12301,65,�k�C��,�o�ʎs,�T�c�L�O����,�J���_�L�l���R�E�G��,,1002,�k�C���o�ʎs�x�ݒ�3-4-1,,42.386238,141.060923,0143-86-2511,,,�o�ʎs,���ΐ��؋��y��,8:30,17:00,,12/29-1/3,,,,
12301,66,�k�C��,�o�ʎs,������,�J���J�~�R�E�G��,,1002,�k�C���o�ʎs���ؒ�5-43-4,,42.419403,141.080008,0143-86-2511,,,�o�ʎs,���ΐ��؋��y��,,,,,,,,
12301,67,�k�C��,�o�ʎs,��㎩�R����,�J���J�~�V�[���R�E�G��,,1002,�k�C���o�ʎs��㒬277-12,,42.43591,141.070815,,,,�o�ʎs,���ΐ��؋��y��,,,,,,,,
12301,68,�k�C��,�o�ʎs,�o�ʉ��򕪒c�Ԍ�,�m�{���x�c�I���Z���u���_���V���R,,1215,�k�C���o�ʎs���o�ʒ�218-2,,42.47503,141.1474,,,,�o�ʎs,���ΐ��؋��y��,,,,,,,,
12301,69,�k�C��,�o�ʎs,�x�Y���c�Ԍ�,�g�~�E���u���_���V���R,,1215,�k�C���o�ʎs�x�Y��1-52-2,,42.44392,141.157337,,,,�o�ʎs,���ΐ��؋��y��,,,,,,,,
12301,70,�k�C��,�o�ʎs,�y�ʕ��c�E�������c�l��,�z���x�c�u���_���E�W���Z�C�u���_���c���V��,,1215,�k�C���o�ʎs�y�ʒ�3-17-7,,42.411967,141.110768,,,,�o�ʎs,���ΐ��؋��y��,,,,,,,,
12301,71,�k�C��,�o�ʎs,���h�{���E���h��,�V���E�{�E�z���u�E�V���E�{�E�V��,,1214,�k�C���o�ʎs������6-11,,42.413309,141.106188,0143-85-9611,,,�o�ʎs,���ΐ��؋��y��,,,,,,,,
12301,72,�k�C��,�o�ʎs,�x�m���c�l��,�t�W�u���_���c���V��,,1215,�k�C���o�ʎs�x�m��7-1-1,,42.413172,141.097164,,,,�o�ʎs,���ΐ��؋��y��,,,,,,,,
12301,73,�k�C��,�o�ʎs,���h���h�ʎx��,�V���E�{�E�V�����V�x�c�V�V��,,1215,�k�C���o�ʎs�h�ʒ�3-5,,42.360821,141.048596,0143-86-7359,,,�o�ʎs,���ΐ��؋��y��,,,,,,,,
12301,74,�k�C��,�o�ʎs,�o�ʕ��c�l��,�m�{���x�c�u���_���c���V��,,1215,�k�C���o�ʎs�o�ʓ���2-21-1,,42.45233,141.1773,,,,�o�ʎs,���ΐ��؋��y��,,,,,,,,
12301,75,�k�C��,�o�ʎs,���h�����x��,�V���E�{�E�V���q�K�V�V�V��,,1215,�k�C���o�ʎs���o�ʒ�207,,42.47448,141.1476,0143-83-9119,,,�o�ʎs,���ΐ��؋��y��,,,,,,,,
12301,76,�k�C��,�o�ʎs,�o�ʒ��w�Z,�m�{���x�c�`���E�K�b�R�E,,1504,�k�C���o�ʎs�o�ʖ{��1-1-1,,42.450948,141.174359,0143-83-1029,,,�o�ʎs,���ΐ��؋�,8:00,16:30,,�j���A�j���̐U�֓��A�N���N�n(12/29-1/3)�A�J�Z�L�O���A�w�Z����������,,,,
12301,77,�k�C��,�o�ʎs,�o�ʏ��w�Z,�m�{���x�c�V���E�K�b�R�E,,1503,�k�C���o�ʎs�o�ʖ{��3-25-2,,42.449404,141.16745,0143-83-1014,,,�o�ʎs,���ΐ��؋�,8:00,16:30,,�j���A�j���̐U�֓��A�N���N�n(12/29-1/3)�A�J�Z�L�O���A�w�Z����������,,,,
12301,78,�k�C��,�o�ʎs,�y�ʒ��w�Z,�z���x�c�`���E�K�b�R�E,,1504,�k�C���o�ʎs��Β�3-1-3,,42.41918,141.109053,0143-85-3111,,,�o�ʎs,���ΐ��؋�,8:00,16:30,,�j���A�j���̐U�֓��A�N���N�n(12/29-1/3)�A�J�Z�L�O���A�w�Z����������,,,,
12301,79,�k�C��,�o�ʎs,�y�ʓ����w�Z,�z���x�c�q�K�V�V���E�K�b�R�E,,1503,�k�C���o�ʎs�y�ʒ�8-16-1,,42.416007,141.118371,0143-85-3532,,,�o�ʎs,���ΐ��؋�,7:55,16:25,,�j���A�j���̐U�֓��A�N���N�n(12/29-1/3)�A�J�Z�L�O���A�w�Z����������,,,,
12301,80,�k�C��,�o�ʎs,�y�ʏ��w�Z,�z���x�c�V���E�K�b�R�E,,1503,�k�C���o�ʎs������6-19-1,,42.413734,141.107363,0143-85-2521,,,�o�ʎs,���ΐ��؋�,8:05,16:35,,�j���A�j���̐U�֓��A�N���N�n(12/29-1/3)�A�J�Z�L�O���A�w�Z����������,,,,
12301,81,�k�C��,�o�ʎs,�y�ʐ����w�Z,�z���x�c�j�V�V���E�K�b�R�E,,1503,�k�C���o�ʎs�Бq��5-13,,42.414514,141.085975,0143-85-2364,,,�o�ʎs,���ΐ��؋�,8:00,16:30,,�j���A�j���̐U�֓��A�N���N�n(12/29-1/3)�A�J�Z�L�O���A�w�Z����������,,,,
12301,82,�k�C��,�o�ʎs,���˒��w�Z,�Z�C�����E�`���E�K�b�R�E,,1504,�k�C���o�ʎs�Бq��5-12-1,,42.414974,141.087365,0143-85-5041,,,�o�ʎs,���ΐ��؋�,8:00,16:30,,�j���A�j���̐U�֓��A�N���N�n(12/29-1/3)�A�J�Z�L�O���A�w�Z����������,,,,
12301,83,�k�C��,�o�ʎs,�t���w�Z,�A�I�o�V���E�K�b�R�E,,1503,�k�C���o�ʎs�t��3-3,,42.401844,141.084216,0143-85-1477,,,�o�ʎs,���ΐ��؋�,8:00,16:30,,�j���A�j���̐U�֓��A�N���N�n(12/29-1/3)�A�J�Z�L�O���A�w�Z����������,,,,
12301,84,�k�C��,�o�ʎs,�Ηz���w�Z,�����N���E�`���E�K�b�R�E,,1504,�k�C���o�ʎs�x�ݒ�1-11-1,,42.41497,141.087429,0143-85-5409,,,�o�ʎs,���ΐ��؋�,8:00,16:30,,�j���A�j���̐U�֓��A�N���N�n(12/29-1/3)�A�J�Z�L�O���A�w�Z����������,,,,
12301,85,�k�C��,�o�ʎs,�x�ݏ��w�Z,�g���P�V�V���E�K�b�R�E,,1503,�k�C���o�ʎs�x�ݒ�2-17-4,,42.384063,141.067988,0143-86-6303,,,�o�ʎs,���ΐ��؋�,8:00,16:30,,�j���A�j���̐U�֓��A�N���N�n(12/29-1/3)�A�J�Z�L�O���A�w�Z����������,,,,
12301,86,�k�C��,�o�ʎs,�ᑐ���w�Z,���J�N�T�V���E�K�b�R�E,,1503,�k�C���o�ʎs�ᑐ��1-1-2,,42.365433,141.050913,0143-86-7513,,,�o�ʎs,���ΐ��؋�,8:00,16:30,,�j���A�j���̐U�֓��A�N���N�n(12/29-1/3)�A�J�Z�L�O���A�w�Z����������,,,,
12301,87,�k�C��,�o�ʎs,�h�ʏ��w�Z,���V�x�c�V���E�K�b�R�E,,1503,�k�C���o�ʎs�h�ʒ�4-36-21,,42.36095,141.052995,0143-86-7011,,,�o�ʎs,���ΐ��؋�,8:00,16:30,,�j���A�j���̐U�֓��A�N���N�n(12/29-1/3)�A�J�Z�L�O���A�w�Z����������,,,,
12301,88,�k�C��,�o�ʎs,�h�ʒ��w�Z,���V�x�c�`���E�K�b�R�E,,1504,�k�C���o�ʎs�h�ʒ�4-36-6,,42.360344,141.052501,0143-86-7950,,,�o�ʎs,���ΐ��؋�,8:05,16:35,,�j���A�j���̐U�֓��A�N���N�n(12/29-1/3)�A�J�Z�L�O���A�w�Z����������,,,,
12301,89,�k�C��,�o�ʎs,�J�����X���,�J�����X�J�C�J��,,1305,�k�C���o�ʎs�J�����X��27-7,,42.520573,141.107267,,,,�o�ʎs,���ΐ��؋��y��,9:00,22:00,,,,,,
12301,90,�k�C��,�o�ʎs,���Ԃ��̉�,�R�u�V�m�C�G,,1305,�k�C���o�ʎs���ؒ�4-24-42,,42.421184,141.097066,,,,�o�ʎs,���ΐ��؋��y��,9:00,22:00,,,,,,
12301,91,�k�C��,�o�ʎs,�V����,�V���J���J�C�J��,,1305,�k�C���o�ʎs�V�쒬4-15-11,,42.412418,141.091087,,,,�o�ʎs,���ΐ��؋��y��,9:00,22:00,,,,,,
12301,92,�k�C��,�o�ʎs,���؉��,�T�N���M�J�C�J��,,1305,�k�C���o�ʎs���ؒ�2-15-17,,42.405096,141.090301,,,,�o�ʎs,���ΐ��؋��y��,9:00,22:00,,,,,,
12301,93,�k�C��,�o�ʎs,�h���,�T�J�G�J�C�J��,,1305,�k�C���o�ʎs�h��2-7-5,,42.367901,141.061536,,,,�o�ʎs,���ΐ��؋��y��,9:00,22:00,,,,,,
12301,94,�k�C��,�o�ʎs,�ᑐ���,���J�N�T�J�C�J��,,1305,�k�C���o�ʎs�ᑐ��2-2-7,,42.368823,141.055273,,,,�o�ʎs,���ΐ��؋��y��,9:00,22:00,,,,,,
12301,95,�k�C��,�o�ʎs,��a��,�Z�����G��,,1307,�k�C���o�ʎs�o�ʉ���17,,42.49133,141.144642,0143-83-1131,,,�o�ʎs,���ΐ��؋��y��,9:00,22:00,,12/29-1/3,,,,
12301,96,�k�C��,�o�ʎs,�h�ʃR�~���j�e�B�Z���^�[,���V�x�c�R�~���j�e�B�Z���^�[,,1307,�k�C���o�ʎs�h�ʒ�3-3-4,,42.361015,141.048467,0143-86-8823,,,�o�ʎs,���ΐ��؋��y��,9:00,22:00,,12/29-1/3,,,,
12301,97,�k�C��,�o�ʎs,�̂ڂ�ׂ����𗬊كJ���g�E����,�m�{���x�c�u���J�R�E�����E�J���J���g�E����,,1305,�k�C���o�ʎs�o�ʉ���123-1,,42.480447,141.146518,0143-84-2069,,,�o�ʎs,�ΐ��؋��y��,9:00,17:30,�j���̌��j���J�فA�W�����w��10�F00�`17�F00�i11����16:00�܂Łj,�j���̗���(���̓������j�̏ꍇ�͗��X��)�12������3��,,,,
12301,98,�k�C��,�o�ʎs,���N���,�Z�C�V���E�l���J�C�J��,,1305,�k�C���o�ʎs������5-21-12,,42.414029,141.103678,0143-85-3107,,,�o�ʎs,���ΐ��؋��y��,9:00,22:00,,12/29-1/3,,,,
12301,99,�k�C��,�o�ʎs,�x�ݎ����N���u,�g���P�V�W�h�E�N���u,,1305,�k�C���o�ʎs�x�ݒ�2-23-15,,42.385715,141.068353,0143-86-2449,,,�o�ʎs,���ΐ��؋��y��,9:00,22:00,,12/29-1/3,,,,
12301,100,�k�C��,�o�ʎs,�s���v-���炭��,�V�~���v-�����N�A,,1107,�k�C���o�ʎs�K��1-5-2,,42.422995,141.125768,0143-85-5588,,,�o�ʎs,���ΐ��؋��y��,10:00,21:00,,��1�y�ё�3���j�i�������A�����̏j���Ɋւ���@����3���ɋK�肷��x���ɓ�������������j�A12/30-1/3,,,,
12301,101,�k�C��,�o�ʎs,���u�ʂ̐X�^������,�I�J�V�x�c�m�����E���h�E�R�E�G��,,1002,�k�C���o�ʎs��Β�97,,42.425749,141.117915,0143-88-2525,,,�o�ʎs,���ΐ��؋��y��,6:00,21:00,���p���鋣�Z�Ǝ����ɂ�藘�p�ł��鎞�ԑт��قȂ�,11������4/9�܂�,,,,
12301,102,�k�C��,�o�ʎs,�w�Z���H�Z���^�[,�K�b�R�E�L���E�V���N�Z���^-,,1599,�k�C���o�ʎs��Β�3-1-3,,42.419621,141.108259,0143-85-2723,,,�o�ʎs,���ΐ��؋�,8:00,16:30,,,,,,
12301,103,�k�C��,�o�ʎs,�s���}����,�V���c�g�V���J��,,1512,�k�C���o�ʎs������5-21-1,,42.414029,141.104096,0143-85-4324,,,�o�ʎs,�ΐ��؋��y��,10:00,18:00,���T�ؗj��19:30�܂ŗ��p��,�j���A�����ŏI���j�A12/29-1/3,,,,
12301,104,�k�C��,�o�ʎs,�s�����,�V�~���J�C�J��,,1599,�k�C���o�ʎs�x�m��7-33-1,,42.414764,141.093764,0143-88-1139,,,�o�ʎs,���ΐ��؋��y��,9:00,22:00,,12/29-1/3,,,,
12301,105,�k�C��,�o�ʎs,���y������,�L���E�h�V�����E�J��,,803,�k�C���o�ʎs�Бq��6-27-2,,42.420556,141.081952,0143-88-1339,,,�o�ʎs,�ΐ��؋��y��,10:00,17:00,�j���̌��j���J�فA11������3����16�F00�܂�,�j���̗����i���̓������j�̏ꍇ�͗��X���j�A12/29-1/3,,,,
12301,106,�k�C��,�o�ʎs,�����`����,�u���J�f���V���E�J��,,803,�k�C���o�ʎs�Бq��6-27-2,,42.420556,141.081952,0143-88-1339,,,�o�ʎs,�ΐ��؋��y��,10:00,17:00,�j���̌��j���J�فA11������3����16�F00�܂�,�j���̗����i���̓������j�̏ꍇ�͗��X���j�A12/29-1/3,,,,
12301,107,�k�C��,�o�ʎs,�l�C�`��-�Z���^-�ӂ��ꂷ�ƍz�R,�l�C�`��-�Z���^-�t�H���X�g�R�E�U��,,1099,�k�C���o�ʎs�z�R��8-3,,42.468162,141.037261,0143-85-2569,,,�o�ʎs,�ΐ��؋��y��,9:00,17:30,�j���̌��j���J��,�j���̌��j���J�فi�����فj�A12/29-1/3,,,,
12301,108,�k�C��,�o�ʎs,�����̈��,�\�E�S�E�^�C�C�N�J��,,1110,�k�C���o�ʎs��R��2-26-1,,42.392235,141.079795,0143-85-5552,,,�o�ʎs,���ΐ��؋��y��,9:00,21:00,,12/29-1/3,,,,
12301,109,�k�C��,�o�ʎs,�s�������Z���^�[�̂ڂ��,�V�~���J�c�h�E�Z���^�[�m�{����,,1305,�k�C���o�ʎs�Β�1-1-4,,42.401291,141.094231,0143-83-6866,,,�o�ʎs,���ΐ��؋��y��,9:00,22:00,�y�j�A���j�̕َ��Ԃ�18:00,�j���A12/29-1/3,,,,
12301,110,�k�C��,�o�ʎs,�o�ʉ��򕪒c�J�����X�Ԍ�,�m�{���x�c�I���Z���u���_���J�����X�V���R,,1215,�k�C���o�ʎs�J�����X��14,,42.520085,141.107621,,,,�o�ʎs,���ΐ��؋��y��,,,,,,,,
12301,111,�k�C��,�o�ʎs,�V�l��̍�Ə�,���E�W���V���~�m�T�M���E�V��,,1499,�k�C���o�ʎs�y�ʒ��V���ڂS�Ԓn�T,,42.41711,141.1169,,,,�o�ʎs,���ΐ��؋��y��,9:00,17:00,,,,,,
12301,112,�k�C��,�o�ʎs,�ό��𗬃Z���^�[,�J���R�E�R�E�����E�Z���^�[�@�k�v��,,1309,�k�C���o�ʎs�o�ʍ`���P���ڂS�Ԓn�X,,42.452817,141.181117,0143-50-6602,,,�o�ʎs,���ΐ��؋��y��,9:00,17:30,��Ԃ̑݊ق�����ꍇ�́A�ő�21�F00,12/29-1/3�i�ύX�̉\������j,,,,
